BDBM133322 US8846719, 5
SMILES Cc1onc(c1COc1ccc(cn1)C#N)-c1ccccc1
InChI Key InChIKey=FYYZBZJEULZXAP-UHFFFAOYSA-N
Data  1 KI
  Tab Delimited (TSV)   2D SDfile   Computed 3D by Vconf -m prep SDfile
Find this compound or compounds like it in BindingDB:
Activity Spreadsheet -- Enzyme Inhibition Constant Data from BindingDB
Found 1 hit for monomerid = 133322
TargetGamma-aminobutyric acid receptor subunit alpha-5(Homo sapiens (Human))
Roche Palo Alto
US Patent
LigandPNGBDBM133322(US8846719, 5)
Affinity DataKi:  13.1nM ΔG°:  -9.99kcal/molepH: 7.5 T: 2°C. Assay description: Radioligand binding assays were carried out in a volume of 200 mL (96-well plates) which contained 100 mL of cell memebranes, [3H]flumazenil at a con...
In DepthDetails US Patent