BDBM133413 US8846719, 98
SMILES Cc1onc(c1COc1ccc(cn1)C(=O)NCC(F)(F)F)-c1cccc(Cl)c1
InChI Key InChIKey=YLMDCXWBSQNQOX-UHFFFAOYSA-N
Data  1 KI
  Tab Delimited (TSV)   2D SDfile   Computed 3D by Vconf -m prep SDfile
Find this compound or compounds like it in BindingDB:
Activity Spreadsheet -- Enzyme Inhibition Constant Data from BindingDB
Found 1 hit for monomerid = 133413
TargetGamma-aminobutyric acid receptor subunit alpha-5(Homo sapiens (Human))
Roche Palo Alto
US Patent
LigandPNGBDBM133413(US8846719, 98)
Affinity DataKi:  7.80nM ΔG°:  -10.3kcal/molepH: 7.5 T: 2°C. Assay description: Radioligand binding assays were carried out in a volume of 200 mL (96-well plates) which contained 100 mL of cell memebranes, [3H]flumazenil at a con...
In DepthDetails US Patent