BDBM133427 US8846719, 112
SMILES Cc1onc(c1COc1ccc(cn1)C(=O)N1CCS(=O)(=O)CC1)-c1ccc(F)cc1
InChI Key InChIKey=VCGRFBXVSFAGGA-UHFFFAOYSA-N
Data  6 KI
PDB links: 1 PDB ID matches this monomer.
  Tab Delimited (TSV)   2D SDfile   Computed 3D by Vconf -m prep SDfile
Find this compound or compounds like it in BindingDB:
Activity Spreadsheet -- Enzyme Inhibition Constant Data from BindingDB
Found 6 hits for monomerid = 133427
TargetGABA-A receptor; alpha-5/beta-3/gamma-2(Homo sapiens (Human))
Gedeon Richter
Curated by ChEMBL
LigandPNGBDBM133427(US8846719, 112)
Affinity DataKi:  4.40nM. Assay description: Displacement of [3H]Ro151788 from human recombinant alpha5beta3gamma2 GABAA receptor stably expressed in HEK293 cell membrane assessed as inhibition ...
TargetGamma-aminobutyric acid receptor subunit alpha-5(Homo sapiens (Human))
Roche Palo Alto
US Patent
LigandPNGBDBM133427(US8846719, 112)
Affinity DataKi:  4.70nM ΔG°:  -10.6kcal/molepH: 7.5 T: 2°C. Assay description: Radioligand binding assays were carried out in a volume of 200 mL (96-well plates) which contained 100 mL of cell memebranes, [3H]flumazenil at a con...
TargetGamma-aminobutyric acid receptor subunit alpha-5(Homo sapiens (Human))
Roche Palo Alto
US Patent
LigandPNGBDBM133427(US8846719, 112)
Affinity DataKi:  4.70nM. Assay description: Binding affinity to GABA-A alpha5 (unknown origin)
TargetGamma-aminobutyric acid receptor subunit alpha-3(Homo sapiens (Human))
University Of Sussex
Curated by ChEMBL
LigandPNGBDBM133427(US8846719, 112)
Affinity DataKi:  489nM. Assay description: Binding affinity to GABA-A alpha3 (unknown origin)
In DepthDetails ArticlePubMed
TargetGamma-aminobutyric acid receptor subunit alpha-2(Homo sapiens (Human))
University Of Sussex
Curated by ChEMBL
LigandPNGBDBM133427(US8846719, 112)
Affinity DataKi:  502nM. Assay description: Binding affinity to GABA-A alpha2 (unknown origin)
In DepthDetails ArticlePubMed
TargetGamma-aminobutyric acid receptor subunit alpha-1(Homo sapiens (Human))
University Of Sussex
Curated by ChEMBL
LigandPNGBDBM133427(US8846719, 112)
Affinity DataKi:  985nM. Assay description: Binding affinity to GABA-A alpha1 (unknown origin)
In DepthDetails ArticlePubMed