BDBM13372 CAAX Analogue 15::Compound XV::methyl (2S)-2-[(2R)-2-[(2S)-2-[(2R)-2-amino-3-sulfanylpropanamido]-3-methylbutanamido]-3-(4-hydroxy-2,3-dimethylphenyl)propanamido]-4-(methylsulfanyl)butanoate
SMILES COC(=O)[C@H](CCSC)NC(=O)[C@@H](Cc1ccc(O)c(C)c1C)NC(=O)[C@@H](NC(=O)[C@@H](N)CS)C(C)C
InChI Key InChIKey=AGJSNMGHAVDLRQ-HUUJSLGLSA-N
Data  1 IC50
  Tab Delimited (TSV)   2D SDfile   Computed 3D by Vconf -m prep SDfile
Find this compound or compounds like it in BindingDB:
Activity Spreadsheet -- Enzyme Inhibition Constant Data from BindingDB
Found 1 hit for monomerid = 13372
TargetProtein farnesyltransferase/geranylgeranyltransferase type-1 subunit alpha(Bos taurus (bovine))
Universita Di Napoli Federico Ii
LigandPNGBDBM13372(CAAX Analogue 15 | Compound XV | methyl (2S)-2-[(2...)
Affinity DataIC50:  7.05E+4nMpH: 7.5 T: 2°C. Assay description: Assays for PFT activity were performed with a PFT-specific scintillation assay (SPA) kit (Amersham Biosciences, Piscataway, NJ). IC50 values were cal...
In DepthDetails ArticlePubMed