BDBM1339 3-Aminopyridin-2(1H)-one analogue 59::3-{[(4,7-dichloro-1,3-benzoxazol-2-yl)methyl]amino}-5-ethyl-6-methyl-1,2-dihydropyridine-2-thione
SMILES CCc1cc(NCc2nc3c(Cl)ccc(Cl)c3o2)c(=S)[nH]c1C
InChI Key InChIKey=UQMLJOLGLHVTER-UHFFFAOYSA-N
Data  1 IC50
  Tab Delimited (TSV)   2D SDfile   Computed 3D by Vconf -m prep SDfile
Find this compound or compounds like it in BindingDB:
Activity Spreadsheet -- Enzyme Inhibition Constant Data from BindingDB
Found 1 hit for monomerid = 1339
TargetGag-Pol polyprotein [588-1027]/[588-1147](Human immunodeficiency virus type 1)
Merck Research Laboratories
LigandPNGBDBM1339(3-Aminopyridin-2(1H)-one analogue 59 | 3-{[(4,7-di...)
Affinity DataIC50:  42nM. Assay description: The IC50 of reverse transcriptase is the concentration that inhibits 50% of recombinant HIV-1 RT RNA-directed DNA polymerase activity in vitro.
In DepthDetails ArticlePubMed