BDBM134165 US8846689, 167
SMILES COc1cc(C(=O)N[C@@H]2CCN(C)C[C@@H]2F)c(F)cc1Nc1ncc(Cl)c(Oc2cccc3CN(C)C(=O)c23)n1
InChI Key InChIKey=HKUKKFTZEWKLTB-RBUKOAKNSA-N
Data  1 IC50
  Tab Delimited (TSV)   2D SDfile   Computed 3D by Vconf -m prep SDfile
Find this compound or compounds like it in BindingDB:
Activity Spreadsheet -- Enzyme Inhibition Constant Data from BindingDB
Found 1 hit for monomerid = 134165
TargetFocal adhesion kinase 1(Homo sapiens (Human))
Boehringer Ingelheim International
US Patent
LigandPNGBDBM134165(US8846689, 167)
Affinity DataIC50:  2nMpH: 7.5Assay Description:This test uses active PTK2 enzyme (Invitrogen Code PV3832) and poly-Glu-Tyr (4:1, Sigma P-0275) as the kinase substrate. The kinase activity is detec...
In DepthDetails US Patent