BDBM134261 US8846660, 29
SMILES COc1ccc(Cl)cc1CC1CN\C(CN(C(=O)N[C@H](C)c2ccc(C(O)=O)c(N)c2)C1=O)=N/Oc1ccc(F)cc1
InChI Key InChIKey=XCNINPDPLRWPRN-VTBWFHPJSA-N
Data  1 IC50
  Tab Delimited (TSV)   2D SDfile   Computed 3D by Vconf -m prep SDfile
Find this compound or compounds like it in BindingDB:
Activity Spreadsheet -- Enzyme Inhibition Constant Data from BindingDB
Found 1 hit for monomerid = 134261
TargetChymase(Homo sapiens (Human))
Daiichi Sankyo
US Patent
LigandPNGBDBM134261(US8846660, 29)
Affinity DataIC50:  10nMpH: 7.5 T: 2°C. Assay description: The inhibitory activity of the compounds of the present invention for recombinant human chymase was measured by the method of Pasztor et al. (Pasztor...
In DepthDetails US Patent