BDBM134269 US8846660, 44
SMILES CC[C@@H](NC(=O)N1C\C(NCC(Cc2cc(Cl)ccc2OC)C1=O)=N\Oc1cc(F)cc(F)c1)c1ccc(C(O)=O)c(O)c1
InChI Key InChIKey=XOLVVPJVGKWJAQ-VCUSLETLSA-N
Data  1 IC50
  Tab Delimited (TSV)   2D SDfile   Computed 3D by Vconf -m prep SDfile
Find this compound or compounds like it in BindingDB:
Activity Spreadsheet -- Enzyme Inhibition Constant Data from BindingDB
Found 1 hit for monomerid = 134269
TargetChymase(Homo sapiens (Human))
Daiichi Sankyo
US Patent
LigandPNGBDBM134269(US8846660, 44)
Affinity DataIC50:  20nMpH: 7.5 T: 2°C. Assay description: The inhibitory activity of the compounds of the present invention for recombinant human chymase was measured by the method of Pasztor et al. (Pasztor...
In DepthDetails US Patent