BDBM134273 US8846660, 64
SMILES CC[C@@H](NC(=O)N1C\C(NCC(Cc2cc(Cl)ccc2OC)C1=O)=N\Oc1ccccc1)c1ccc(CC(O)=O)cc1
InChI Key InChIKey=DZBVADVKQFGEER-ANWICMFUSA-N
Data  1 IC50
  Tab Delimited (TSV)   2D SDfile   Computed 3D by Vconf -m prep SDfile
Find this compound or compounds like it in BindingDB:
Activity Spreadsheet -- Enzyme Inhibition Constant Data from BindingDB
Found 1 hit for monomerid = 134273
TargetChymase(Homo sapiens (Human))
Daiichi Sankyo
US Patent
LigandPNGBDBM134273(US8846660, 64)
Affinity DataIC50:  30nMpH: 7.5 T: 2°C. Assay description: The inhibitory activity of the compounds of the present invention for recombinant human chymase was measured by the method of Pasztor et al. (Pasztor...
In DepthDetails US Patent