BDBM134386 US8846658, 100
SMILES CC1(N=C(N)COCC1(F)F)c1cc(NC(=O)c2ccc(Cl)cn2)ccc1F
InChI Key InChIKey=BAVSGDZAGDONMG-UHFFFAOYSA-N
Data  1 IC50
  Tab Delimited (TSV)   2D SDfile   Computed 3D by Vconf -m prep SDfile
Find this compound or compounds like it in BindingDB:
Activity Spreadsheet -- Enzyme Inhibition Constant Data from BindingDB
Found 1 hit for monomerid = 134386
TargetBeta-secretase 1(Homo sapiens (Human))
Novartis
US Patent
LigandPNGBDBM134386(US8846658, 100)
Affinity DataIC50:  34nMpH: 4.5 T: 2°C. Assay description: Recombinant BACE-1 (extracellular domain, expressed in baculovirus and purified using standard methods) at 0.1 to 10 nM concentrations is incubated w...
In DepthDetails US Patent