BDBM1344 3-Aminopyridin-2(1H)-one analogue 64::3-{[(4,7-dichloro-1,3-benzoxazol-2-yl)methyl]amino}-4,6-dimethyl-1,2-dihydropyridin-2-one
SMILES Cc1cc(C)c(NCc2nc3c(Cl)ccc(Cl)c3o2)c(=O)[nH]1
InChI Key InChIKey=WLRKCGBECWLZJJ-UHFFFAOYSA-N
Data  1 IC50
  Tab Delimited (TSV)   2D SDfile   Computed 3D by Vconf -m prep SDfile
Find this compound or compounds like it in BindingDB:
Activity Spreadsheet -- Enzyme Inhibition Constant Data from BindingDB
Found 1 hit for monomerid = 1344
TargetGag-Pol polyprotein [588-1027]/[588-1147](Human immunodeficiency virus type 1)
Merck Research Laboratories
LigandPNGBDBM1344(3-Aminopyridin-2(1H)-one analogue 64 | 3-{[(4,7-di...)
Affinity DataIC50:  2.85E+3nM. Assay description: The IC50 of reverse transcriptase is the concentration that inhibits 50% of recombinant HIV-1 RT RNA-directed DNA polymerase activity in vitro.
In DepthDetails ArticlePubMed