BDBM135184 US8846657, 3.77
SMILES C[C@H]1CC[C@H](Cn2c(nc3cc(nc(-c4cncc(Cl)c4)c23)-c2noc(=O)[nH]2)N2CCCC3COCCC23)CC1
InChI Key
Data  4 IC50
  Tab Delimited (TSV)   2D SDfile   Computed 3D by Vconf -m prep SDfile
Find this compound or compounds like it in BindingDB:
Activity Spreadsheet -- Enzyme Inhibition Constant Data from BindingDB
Found 4 hits for monomerid = 135184
TargetE3 ubiquitin-protein ligase Mdm2(Homo sapiens (Human))
Merck Sharp & Dohme
US Patent
LigandPNGBDBM135184(US8846657, 3.77)
Affinity DataIC50:  10nM. Assay description: Methods: An HDM2 FRET assay was developed to assess the compounds' inhibitory activity towards binding of p53 protein. A truncated version of HDM2 wi...
In DepthDetails US Patent
TargetE3 ubiquitin-protein ligase Mdm2(Homo sapiens (Human))
Merck Sharp & Dohme
US Patent
LigandPNGBDBM135184(US8846657, 3.77)
Affinity DataIC50:  8nM. Assay description: Methods: An HDM2 FRET assay was developed to assess the compounds' inhibitory activity towards binding of p53 protein. A truncated version of HDM2 wi...
In DepthDetails US Patent
TargetE3 ubiquitin-protein ligase Mdm2(Homo sapiens (Human))
Merck Sharp & Dohme
US Patent
LigandPNGBDBM135184(US8846657, 3.77)
Affinity DataIC50:  29nM. Assay description: Methods: An HDM2 FRET assay was developed to assess the compounds' inhibitory activity towards binding of p53 protein. A truncated version of HDM2 wi...
In DepthDetails US Patent
TargetE3 ubiquitin-protein ligase Mdm2(Homo sapiens (Human))
Merck Sharp & Dohme
US Patent
LigandPNGBDBM135184(US8846657, 3.77)
Affinity DataIC50:  10nM. Assay description: Methods: An HDM2 FRET assay was developed to assess the compounds' inhibitory activity towards binding of p53 protein. A truncated version of HDM2 wi...
In DepthDetails US Patent