BDBM135364 US8846657, 7.14
SMILES C[C@H]1CC[C@H](Cn2c(nc3cc(nc(-c4cncc(Cl)c4)c23)-c2noc(=O)[nH]2)C(OCC(F)(F)F)c2ccccn2)CC1
InChI Key
Data  2 IC50
  Tab Delimited (TSV)   2D SDfile   Computed 3D by Vconf -m prep SDfile
Find this compound or compounds like it in BindingDB:
Activity Spreadsheet -- Enzyme Inhibition Constant Data from BindingDB
Found 2 hits for monomerid = 135364
TargetE3 ubiquitin-protein ligase Mdm2(Homo sapiens (Human))
Merck Sharp & Dohme
US Patent
LigandPNGBDBM135364(US8846657, 7.14)
Affinity DataIC50:  3nM. Assay description: Methods: An HDM2 FRET assay was developed to assess the compounds' inhibitory activity towards binding of p53 protein. A truncated version of HDM2 wi...
In DepthDetails US Patent
TargetE3 ubiquitin-protein ligase Mdm2(Homo sapiens (Human))
Merck Sharp & Dohme
US Patent
LigandPNGBDBM135364(US8846657, 7.14)
Affinity DataIC50:  3nM. Assay description: Methods: An HDM2 FRET assay was developed to assess the compounds' inhibitory activity towards binding of p53 protein. A truncated version of HDM2 wi...
In DepthDetails US Patent