BDBM135468 US8853258, 17
SMILES CC(CCc1ccc(OCCC2CC2)cc1)(C(=O)NO)S(C)(=O)=O
InChI Key InChIKey=WZRIGRWLBKRHBP-UHFFFAOYSA-N
Data  1 IC50
  Tab Delimited (TSV)   2D SDfile   Computed 3D by Vconf -m prep SDfile
Find this compound or compounds like it in BindingDB:
Activity Spreadsheet -- Enzyme Inhibition Constant Data from BindingDB
Found 1 hit for monomerid = 135468
TargetUDP-3-O-acyl-N-acetylglucosamine deacetylase(Pseudomonas aeruginosa)
Pfizer
US Patent
LigandPNGBDBM135468(US8853258, 17)
Affinity DataIC50:  1.36nMpH: 8.0Assay Description:IC50 determination in the LpxC enzyme assay was carried out in a similar manner to that described by Malikzay et al in the 2006 Poster, Screening Lpx...
In DepthDetails US Patent