BDBM135531 US8853258, 182
SMILES CC(=O)c1ccc(cc1)-c1ccc(CC[C@](C)(C(=O)NO)S(C)(=O)=O)cc1
InChI Key InChIKey=CIRMNVOQHGJYQO-HXUWFJFHSA-N
Data  1 IC50
  Tab Delimited (TSV)   2D SDfile   Computed 3D by Vconf -m prep SDfile
Find this compound or compounds like it in BindingDB:
Activity Spreadsheet -- Enzyme Inhibition Constant Data from BindingDB
Found 1 hit for monomerid = 135531
TargetUDP-3-O-acyl-N-acetylglucosamine deacetylase(Pseudomonas aeruginosa)
Pfizer
US Patent
LigandPNGBDBM135531(US8853258, 182)
Affinity DataIC50:  0.0674nMpH: 8.0Assay Description:IC50 determination in the LpxC enzyme assay was carried out in a similar manner to that described by Malikzay et al in the 2006 Poster, Screening Lpx...
In DepthDetails US Patent