BDBM135614 US8846000, D-7
SMILES COc1ccc(cc1)-n1c(CCN2C(=O)c3cccc(OC(C)C)c3C2=O)nc2ccccc2c1=O
InChI Key InChIKey=UUAAHYNWZKQZBM-UHFFFAOYSA-N
Data  2 KI
PDB links: 1 PDB ID matches this monomer.
  Tab Delimited (TSV)   2D SDfile   Computed 3D by Vconf -m prep SDfile
Find this compound or compounds like it in BindingDB:
Activity Spreadsheet -- Enzyme Inhibition Constant Data from BindingDB
Found 2 hits for monomerid = 135614
TargetcAMP and cAMP-inhibited cGMP 3',5'-cyclic phosphodiesterase 10A(Homo sapiens (Human))
Merck Research Laboratories
Curated by ChEMBL
LigandPNGBDBM135614(US8846000, D-7)
Affinity DataKi:  0.150nM. Assay description: Inhibition of PDE10A (unknown origin)
TargetcAMP and cAMP-inhibited cGMP 3',5'-cyclic phosphodiesterase 10A(Homo sapiens (Human))
Merck Research Laboratories
Curated by ChEMBL
LigandPNGBDBM135614(US8846000, D-7)
Affinity DataKi:  0.150nM. Assay description: The activity of the compounds in accordance with the present invention as PDE10 inhibitors may be readily determined without undue experimentation us...