BDBM135907 US8859596, 196
SMILES CCCCn1nc(s\c1=N/C(=O)c1cc(ccc1ON=C(N)c1ccccn1)C(F)(F)F)C(C)(C)C
InChI Key InChIKey=LIUVCMPHXCXUSF-SWKFRHMKSA-N
Data  2 KI
  Tab Delimited (TSV)   2D SDfile   Computed 3D by Vconf -m prep SDfile
Find this compound or compounds like it in BindingDB:
Activity Spreadsheet -- Enzyme Inhibition Constant Data from BindingDB
Found 2 hits for monomerid = 135907
TargetCannabinoid receptor 2(Rattus norvegicus (Rat))
Abbvie
US Patent
LigandPNGBDBM135907(US8859596, 196)
Affinity DataKi:  4.10nMpH: 7.4Assay Description:HEK293 cells stably expressing rat CB2 receptors were grown until a confluent monolayer was formed. Briefly, the cells were harvested and homogenized...
In DepthDetails US Patent
TargetCannabinoid receptor 2(Homo sapiens (Human))
Abbvie
US Patent
LigandPNGBDBM135907(US8859596, 196)
Affinity DataKi:  18nM ΔG°:  -10.7kcal/molepH: 7.4 T: 2°C. Assay description: HEK293 cells stably expressing human CB2 receptors were grown until a confluent monolayer was formed. Briefly, the cells were harvested and homogeniz...
In DepthDetails US Patent