BDBM135959 US8853203, 13::US9650377, Example 13
SMILES COc1cccc(c1)C1=NCC(=O)N2CCc3c(OC)c(Cl)ccc3C2=C1
InChI Key InChIKey=ZQLNLYNPYFHOMH-UHFFFAOYSA-N
Data  4 IC50
  Tab Delimited (TSV)   2D SDfile   Computed 3D by Vconf -m prep SDfile
Find this compound or compounds like it in BindingDB:
Activity Spreadsheet -- Enzyme Inhibition Constant Data from BindingDB
Found 4 hits for monomerid = 135959
TargetMetabotropic glutamate receptor 5(Homo sapiens (Human))
Novartis
US Patent
LigandPNGBDBM135959(US8853203, 13 | US9650377, Example 13)
Affinity DataIC50:  82nM. Assay description: Activity of compounds of the present invention was examined by determination to what extent the glutamate-induced elevation of the intracellular calc...
In DepthDetails US Patent
TargetMetabotropic glutamate receptor 1(Homo sapiens (Human))
Novartis
US Patent
LigandPNGBDBM135959(US8853203, 13 | US9650377, Example 13)
Affinity DataIC50:  530nM. Assay description: Activity of compounds of the present invention was examined by determination to what extent the glutamate-induced elevation of the intracellular calc...
In DepthDetails US Patent
TargetMetabotropic glutamate receptor 5(Homo sapiens (Human))
Novartis
US Patent
LigandPNGBDBM135959(US8853203, 13 | US9650377, Example 13)
Affinity DataIC50:  82nM. Assay description: Activity of compounds of the present invention with respect to mGluR1 antagonism was examined by an assay based on measurements of L-glutamate induce...
In DepthDetails US Patent
TargetMetabotropic glutamate receptor 1(Homo sapiens (Human))
Novartis
US Patent
LigandPNGBDBM135959(US8853203, 13 | US9650377, Example 13)
Affinity DataIC50:  530nM. Assay description: Activity of compounds of the present invention was examined by determination to what extent the glutamate-induced elevation of the intracellular calc...
In DepthDetails US Patent