BDBM136039 US8853203, 88f
SMILES O=C1CN=C(C=C2N1CCc1c2cccc1-c1cnccn1)n1cnc(c1)C1CC1
InChI Key InChIKey=LZZDJGGNZRMJTC-UHFFFAOYSA-N
Data  2 IC50
  Tab Delimited (TSV)   2D SDfile   Computed 3D by Vconf -m prep SDfile
Find this compound or compounds like it in BindingDB:
Activity Spreadsheet -- Enzyme Inhibition Constant Data from BindingDB
Found 2 hits for monomerid = 136039
TargetMetabotropic glutamate receptor 1(Homo sapiens (Human))
Novartis
US Patent
LigandPNGBDBM136039(US8853203, 88f)
Affinity DataIC50:  1.95E+3nM. Assay description: Activity of compounds of the present invention was examined by determination to what extent the glutamate-induced elevation of the intracellular calc...
In DepthDetails US Patent
TargetMetabotropic glutamate receptor 5(Homo sapiens (Human))
Novartis
US Patent
LigandPNGBDBM136039(US8853203, 88f)
Affinity DataIC50:  100nM. Assay description: Activity of compounds of the present invention was examined by determination to what extent the glutamate-induced elevation of the intracellular calc...
In DepthDetails US Patent