BDBM136223 US8853193, 33
SMILES COC(=O)c1sc2ncnc(Nc3cccnc3OCC3(CC#N)CC3)c2c1C
InChI Key InChIKey=IKMICGPKOJXMKR-UHFFFAOYSA-N
Data  1 IC50
  Tab Delimited (TSV)   2D SDfile   Computed 3D by Vconf -m prep SDfile
Find this compound or compounds like it in BindingDB:
Activity Spreadsheet -- Enzyme Inhibition Constant Data from BindingDB
Found 1 hit for monomerid = 136223
TargetMAP kinase-interacting serine/threonine-protein kinase 2(Homo sapiens (Human))
Boehringer Ingelheim International
US Patent
LigandPNGBDBM136223(US8853193, 33)
Affinity DataIC50:  47nMpH: 7.4 T: 2°C. Assay description: Inhibition of kinase activity of Mnk1 and Mnk2a was assessed with the same assay system, using pre-activated GST-Mnk1 or GST-Mnk2a, respectively. The...
In DepthDetails US Patent