BDBM136366 US8859534, 52
SMILES COc1cc(N2CCN(CCc3ccccn3)CC2)c2oc(cc2c1)C(=O)N(C)C
InChI Key InChIKey=GCWPXICDMYAAJZ-UHFFFAOYSA-N
Data  2 KI
  Tab Delimited (TSV)   2D SDfile   Computed 3D by Vconf -m prep SDfile
Find this compound or compounds like it in BindingDB:
Activity Spreadsheet -- Enzyme Inhibition Constant Data from BindingDB
Found 2 hits for monomerid = 136366
Target5-hydroxytryptamine receptor 1A(Cricetulus griseus (Chinese hamster) (Cricetulus b...)
Acturum Life Science
US Patent
LigandPNGBDBM136366(US8859534, 52)
Affinity DataKi:  2.80nMpH: 7.4Assay Description:Assays that were used to measure affinity of the compounds of the present invention for 5-HT1A and 5-HT1B receptors are described in J. Recept Signal...
In DepthDetails US Patent
Target5-hydroxytryptamine receptor 1B(Cricetulus griseus (Chinese hamster) (Cricetulus b...)
Acturum Life Science
US Patent
LigandPNGBDBM136366(US8859534, 52)
Affinity DataKi:  140nMpH: 7.4Assay Description:Assays that were used to measure affinity of the compounds of the present invention for 5-HT1A and 5-HT1B receptors are described in J. Recept Signal...
In DepthDetails US Patent