BDBM136521 US8865714, 8
SMILES Cn1cccc1C(=O)N1CCN(CC1)C(=N)Nc1ccc(cc1)N1CCC(CCn2cncn2)CC1
InChI Key InChIKey=ZOZUGQNXLOUPOX-UHFFFAOYSA-N
Data  1 IC50
  Tab Delimited (TSV)   2D SDfile   Computed 3D by Vconf -m prep SDfile
Find this compound or compounds like it in BindingDB:
Activity Spreadsheet -- Enzyme Inhibition Constant Data from BindingDB
Found 1 hit for monomerid = 136521
TargetHematopoietic prostaglandin D synthase(Homo sapiens (Human))
Taiho Pharmaceutical
US Patent
LigandPNGBDBM136521(US8865714, 8)
Affinity DataIC50:  62nMpH: 8.0 T: 2°C. Assay description: The test was carried out according to the method of Urade, Y. et al. (J. Biol. Chem., 262, 3820-3825, (1987)). More specifically, the reaction mixtur...
In DepthDetails US Patent