BDBM136878 US8865911, 111::US9918985, Example 111
SMILES CO[C@]1(C)CC[C@]2(Cc3ccc(cc3C22N=C(C)C(N)=N2)-c2cncc(c2)C#CC)CC1
InChI Key InChIKey=PJFLXADHRCSJTF-KKFOSYPRSA-N
Data  2 IC50
  Tab Delimited (TSV)   2D SDfile   Computed 3D by Vconf -m prep SDfile
Find this compound or compounds like it in BindingDB:
Activity Spreadsheet -- Enzyme Inhibition Constant Data from BindingDB
Found 2 hits for monomerid = 136878
TargetBeta-secretase 1 [1-460](Homo sapiens (Human))
Astrazeneca
US Patent
LigandPNGBDBM136878(US8865911, 111 | US9918985, Example 111)
Affinity DataIC50:  51nM. Assay description: The enzyme (truncated form) was diluted to 6 μg/mL (stock 1.3 mg/mL) and the substrate (Europium)CEVNLDAEFK(Qsy7) to 200 nM (stock 120 μM) ...
In DepthDetails US Patent
TargetBeta-secretase 1(Homo sapiens (Human))
Astrazeneca
US Patent
LigandPNGBDBM136878(US8865911, 111 | US9918985, Example 111)
Affinity DataIC50:  51nMpH: 9.2Assay Description:The beta-secretase enzyme used in the TR-FRET is prepared as follows: The cDNA for the soluble part of the human beta-Secretase (AA 1-AA 460) was clo...
In DepthDetails US Patent