BDBM136903 US10231967, Example 128::US8865911, 128::US9918985, Example 128
SMILES CC1=NC2(N=C1N)c1cc(Br)ccc1CC21CCC(CC1)C(F)F
InChI Key InChIKey=SEMLTECGFLAMPC-UHFFFAOYSA-N
Data  3 IC50
  Tab Delimited (TSV)   2D SDfile   Computed 3D by Vconf -m prep SDfile
Find this compound or compounds like it in BindingDB:
Activity Spreadsheet -- Enzyme Inhibition Constant Data from BindingDB
Found 3 hits for monomerid = 136903
TargetBeta-secretase 1(Homo sapiens (Human))
Astrazeneca
US Patent
LigandPNGBDBM136903(US10231967, Example 128 | US8865911, 128 | US99189...)
Affinity DataIC50:  2.61E+3nMpH: 9.2Assay Description:The beta-secretase enzyme used in the TR-FRET is prepared as follows: The cDNA for the soluble part of the human beta-Secretase (AA 1-AA 460) was clo...
In DepthDetails US Patent
TargetBeta-secretase 1 [1-460](Homo sapiens (Human))
Astrazeneca
US Patent
LigandPNGBDBM136903(US10231967, Example 128 | US8865911, 128 | US99189...)
Affinity DataIC50:  2.61E+3nM. Assay description: The enzyme (truncated form) was diluted to 6 μg/mL (stock 1.3 mg/mL) and the substrate (Europium)CEVNLDAEFK(Qsy7) to 200 nM (stock 120 μM) ...
In DepthDetails US Patent
TargetAmyloid-beta precursor protein(Homo sapiens (Human))
Astrazeneca
US Patent
LigandPNGBDBM136903(US10231967, Example 128 | US8865911, 128 | US99189...)
Affinity DataIC50:  2.61E+3nM. Assay description: The β-secretase enzyme used in the TR-FRET is prepared as follows: The cDNA for the soluble part of the human β-Secretase (AA 1-AA 460) was...
In DepthDetails US Patent