BDBM137041 US8871790, 107
SMILES Cc1cc(C)c(cc1C(=O)N1CCC(CC1)c1ccc(cc1)C#N)-c1nc2cc(ccc2[nH]1)C(O)=O
InChI Key InChIKey=DGXRDMFJIJRIKT-UHFFFAOYSA-N
Data  1 IC50
  Tab Delimited (TSV)   2D SDfile   Computed 3D by Vconf -m prep SDfile
Find this compound or compounds like it in BindingDB:
Activity Spreadsheet -- Enzyme Inhibition Constant Data from BindingDB
Found 1 hit for monomerid = 137041
TargetFatty acid synthase(Homo sapiens (Human))
3-V Biosciences
US Patent
LigandPNGBDBM137041(US8871790, 107)
Affinity DataIC50:  1.49E+3nM. Assay description: The FASN enzyme was isolated from SKBr3 cells. SKBr3 is a human breast cancer cell-line with high levels of FASN expression. It is estimated that FAS...
In DepthDetails US Patent