BDBM137243 US8871790, 322
SMILES Cc1ccc(cc1NC(=O)c1ccc(nc1)N1CCC1)C(=O)N1CCC(F)(CC1)c1ccc(cn1)C#N
InChI Key InChIKey=WOXKITSARLKFGT-UHFFFAOYSA-N
Data  1 IC50
  Tab Delimited (TSV)   2D SDfile   Computed 3D by Vconf -m prep SDfile
Find this compound or compounds like it in BindingDB:
Activity Spreadsheet -- Enzyme Inhibition Constant Data from BindingDB
Found 1 hit for monomerid = 137243
TargetFatty acid synthase(Homo sapiens (Human))
3-V Biosciences
US Patent
LigandPNGBDBM137243(US8871790, 322)
Affinity DataIC50:  180nM. Assay description: The FASN enzyme was isolated from SKBr3 cells. SKBr3 is a human breast cancer cell-line with high levels of FASN expression. It is estimated that FAS...
In DepthDetails US Patent