BDBM137245 US8871790, 324
SMILES COc1ccc(nc1)C1(F)CCN(CC1)C(=O)c1ccc(C)c(NC(=O)NC2CCOC2)c1
InChI Key InChIKey=BLUGHPUKXOWLJS-UHFFFAOYSA-N
Data  1 IC50
  Tab Delimited (TSV)   2D SDfile   Computed 3D by Vconf -m prep SDfile
Find this compound or compounds like it in BindingDB:
Activity Spreadsheet -- Enzyme Inhibition Constant Data from BindingDB
Found 1 hit for monomerid = 137245
TargetFatty acid synthase(Homo sapiens (Human))
3-V Biosciences
US Patent
LigandPNGBDBM137245(US8871790, 324)
Affinity DataIC50:  1.18E+3nM. Assay description: The FASN enzyme was isolated from SKBr3 cells. SKBr3 is a human breast cancer cell-line with high levels of FASN expression. It is estimated that FAS...
In DepthDetails US Patent