BDBM137483 US8871934, 76
SMILES CC(=O)c1ccc2-c3ccccc3C(O)(c2c1)C(F)(F)F
InChI Key InChIKey=NJSCKSHQCBGUSI-UHFFFAOYSA-N
Data  1 IC50
  Tab Delimited (TSV)   2D SDfile   Computed 3D by Vconf -m prep SDfile
Find this compound or compounds like it in BindingDB:
Activity Spreadsheet -- Enzyme Inhibition Constant Data from BindingDB
Found 1 hit for monomerid = 137483
LigandPNGBDBM137483(US8871934, 76)
Affinity DataIC50:  1.75E+3nMpH: 8.0 T: 2°C. Assay description: The inhibitory action of PDHK activity was indirectly evaluated by performing a kinase reaction in the presence of a test compound and measuring the ...
In DepthDetails US Patent