BDBM13761 (1R,3R,4S,7S)-4-[2-(4-methoxyphenoxy)-2-methylpropanamido]adamantane-1-carboxamide::adamantane ether 15
SMILES COc1ccc(OC(C)(C)C(=O)N[C@H]2C3C[C@@H]4C[C@@H]2C[C@](C4)(C3)C(N)=O)cc1
InChI Key InChIKey=MNVKIDPRYUGTTG-HAKNXOCISA-N
Data  5 IC50
PDB links: 1 PDB ID matches this monomer.
  Tab Delimited (TSV)   2D SDfile   Computed 3D by Vconf -m prep SDfile
Find this compound or compounds like it in BindingDB:
Activity Spreadsheet -- Enzyme Inhibition Constant Data from BindingDB
Found 5 hits for monomerid = 13761
Target11-beta-hydroxysteroid dehydrogenase 1(Homo sapiens (Human))
Abbott Laboratories
LigandPNGBDBM13761((1R,3R,4S,7S)-4-[2-(4-methoxyphenoxy)-2-methylprop...)
Affinity DataIC50:  6nMpH: 7.2 T: 2°C. Assay description: Enzyme assays were performed using purified recombinant human or mouse11beta-HSD1. The fractional conversion of cortisone to cortisol was used to det...
Target11-beta-hydroxysteroid dehydrogenase type 2(Homo sapiens (Human))
Abbott Laboratories
LigandPNGBDBM13761((1R,3R,4S,7S)-4-[2-(4-methoxyphenoxy)-2-methylprop...)
Affinity DataIC50:  1.80E+4nM. Assay description: The in Vitro 11beta-HSD2 dehydrogenase assays were developed using the cell lysates that had the full length human or mouse 11beta-HSD2 cDNA over exp...
In DepthDetails ArticlePubMed
Target11-beta-hydroxysteroid dehydrogenase 1(Homo sapiens (Human))
Abbott Laboratories
LigandPNGBDBM13761((1R,3R,4S,7S)-4-[2-(4-methoxyphenoxy)-2-methylprop...)
Affinity DataIC50:  6.03nM. Assay description: Inhibition of 11beta-HSD1
Target11-beta-hydroxysteroid dehydrogenase type 2(Mus musculus (mouse))
Abbott Laboratories
LigandPNGBDBM13761((1R,3R,4S,7S)-4-[2-(4-methoxyphenoxy)-2-methylprop...)
Affinity DataIC50:  5.50E+4nM. Assay description: The in Vitro 11beta-HSD2 dehydrogenase assays were developed using the cell lysates that had the full length human or mouse 11beta-HSD2 cDNA over exp...
In DepthDetails ArticlePubMed
Target11-beta-hydroxysteroid dehydrogenase 1(Mus musculus (mouse))
Abbott Laboratories
LigandPNGBDBM13761((1R,3R,4S,7S)-4-[2-(4-methoxyphenoxy)-2-methylprop...)
Affinity DataIC50:  4nM. Assay description: Enzyme assays were performed using purified recombinant human or mouse11beta-HSD1. The fractional conversion of cortisone to cortisol was used to det...
In DepthDetails ArticlePubMed