BDBM138044 US8871934, 637
SMILES Cn1cc(cn1)-c1cc2c(-c3ccccc3C2(O)C(F)(F)F)c(CC(N)=O)c1
InChI Key InChIKey=FRXAARMCPIPDFK-UHFFFAOYSA-N
Data  1 IC50
  Tab Delimited (TSV)   2D SDfile   Computed 3D by Vconf -m prep SDfile
Find this compound or compounds like it in BindingDB:
Activity Spreadsheet -- Enzyme Inhibition Constant Data from BindingDB
Found 1 hit for monomerid = 138044
LigandPNGBDBM138044(US8871934, 637)
Affinity DataIC50: >1.00E+3nMpH: 8.0 T: 2°C. Assay description: The inhibitory action of PDHK activity was indirectly evaluated by performing a kinase reaction in the presence of a test compound and measuring the ...
In DepthDetails US Patent