BDBM1383 (9bR)-9b-(naphthalen-1-yl)-2H,3H,5H,9bH-isoindolo[1,2-b][1,3]thiazol-5-one::Thiazoloisoindol-5-one deriv. 6R
SMILES O=C1N2CCS[C@@]2(c2ccccc12)c1cccc2ccccc12
InChI Key InChIKey=SPRYWRQUZPBNHD-HXUWFJFHSA-N
Data  1 IC50
  Tab Delimited (TSV)   2D SDfile   Computed 3D by Vconf -m prep SDfile
Find this compound or compounds like it in BindingDB:
Activity Spreadsheet -- Enzyme Inhibition Constant Data from BindingDB
Found 1 hit for monomerid = 1383
TargetGag-Pol polyprotein [588-1027]/[588-1147](Human immunodeficiency virus type 1)
Boehringer Mannheim
LigandPNGBDBM1383((9bR)-9b-(naphthalen-1-yl)-2H,3H,5H,9bH-isoindolo[...)
Affinity DataIC50:  150nMpH: 7.7 T: 2°C. Assay description: The IC50 of reverse transcriptase is the concentration that inhibits 50% of recombinant HIV-1 RT RNA-directed DNA polymerase activity in vitro.
In DepthDetails ArticlePubMed