BDBM138309 US8877944, 13
SMILES NC(=O)c1cccc2CN(C3CCN(Cc4cccc(F)c4)CC3)C(=O)c12
InChI Key InChIKey=DIXQEUSVVHCYGR-UHFFFAOYSA-N
Data  1 Kd
  Tab Delimited (TSV)   2D SDfile   Computed 3D by Vconf -m prep SDfile
Find this compound or compounds like it in BindingDB:
Activity Spreadsheet -- Enzyme Inhibition Constant Data from BindingDB
Found 1 hit for monomerid = 138309
TargetPoly [ADP-ribose] polymerase 1(Mus musculus)
Nerviano Medical Sciences
US Patent
LigandPNGBDBM138309(US8877944, 13)
Affinity DataKd: <30nM. Assay description: The assay is based on the use of a probe of formula (IP) that binds to the NAD binding pocket and takes advantage of the significant change in the po...
In DepthDetails US Patent