BDBM138340 US8877944, 44
SMILES CC(C)Oc1ccc(CN2CCC(CC2)N2Cc3cccc(C(N)=O)c3C2=O)cc1
InChI Key InChIKey=VTOJWYHGKOAOBI-UHFFFAOYSA-N
Data  1 IC50
  Tab Delimited (TSV)   2D SDfile   Computed 3D by Vconf -m prep SDfile
Find this compound or compounds like it in BindingDB:
Activity Spreadsheet -- Enzyme Inhibition Constant Data from BindingDB
Found 1 hit for monomerid = 138340
TargetPoly [ADP-ribose] polymerase 1(Mus musculus)
Nerviano Medical Sciences
US Patent
LigandPNGBDBM138340(US8877944, 44)
Affinity DataIC50:  500nM. Assay description: Affinity evaluation of the tested compounds and their selectivity with respect to the different PARP isoforms of interest was assessed in a displacem...
In DepthDetails US Patent