BDBM13848 2,2,2-trifluoroacetate; 4-[2-({1-[(3-carbamimidoylphenyl)methyl]-1H-indol-2-yl}formamido)ethyl]-1-methylpyridin-1-ium::3-amidinobenzylindole carboxamide 32
SMILES C[n+]1ccc(CCNC(=O)c2cc3ccccc3n2Cc2cccc(c2)C(N)=N)cc1
InChI Key InChIKey=CHPYDCXPEIVQRM-UHFFFAOYSA-O
Data  1 KI
  Tab Delimited (TSV)   2D SDfile   Computed 3D by Vconf -m prep SDfile
Find this compound or compounds like it in BindingDB:
Activity Spreadsheet -- Enzyme Inhibition Constant Data from BindingDB
Found 1 hit for monomerid = 13848
TargetCoagulation factor X(Homo sapiens (Human))
Aventis Pharma Deutschland
LigandPNGBDBM13848(2,2,2-trifluoroacetate; 4-[2-({1-[(3-carbamimidoyl...)
Affinity DataKi:  1.30E+3nM. Assay description: The inhibitory effect of test compound for human fXa was determined by using the chromogenic substrates S-2765. The hydrolysis rates of chromogenic s...
In DepthDetails ArticlePubMed