BDBM139039 US8884017, 88
SMILES CC(=O)Nc1ccc2cc(sc2c1)C(=O)N[C@H]1CN2CCC1CC2
InChI Key InChIKey=VWKAKSVNALAGDO-HNNXBMFYSA-N
Data  1 KI
  Tab Delimited (TSV)   2D SDfile   Computed 3D by Vconf -m prep SDfile
Find this compound or compounds like it in BindingDB:
Activity Spreadsheet -- Enzyme Inhibition Constant Data from BindingDB
Found 1 hit for monomerid = 139039
TargetNeuronal acetylcholine receptor subunit alpha-7(Homo sapiens (Human))
Bayer Intellectual Property
US Patent
LigandPNGBDBM139039(US8884017, 88)
Affinity DataKi:  28nM ΔG°:  -9.57kcal/molepH: 7.4 T: 2°C. Assay description: The [3H]-methyllycaconitine binding assay is a modification of the method described by Davies et al. in Neuropharmacol. 1999, 38, 679-690.Rat brain t...
In DepthDetails US Patent