BDBM139080 US8883771, 26
SMILES CN[C@@H](C)C(=O)N[C@H]1CN(CC[C@H]2CC[C@H](N2C1=O)C(=O)N[C@@H]1C[C@@H]1c1ccccc1)C(=O)Nc1ccc(NC(=O)N2CC[C@H]3CC[C@H](N3C(=O)[C@H](C2)NC(=O)[C@H](C)NC)C(=O)N[C@@H]2C[C@@H]2c2ccccc2)cc1
InChI Key InChIKey=SMKPRIZPBZJBSP-XSJWLWIASA-N
Data  3 IC50
  Tab Delimited (TSV)   2D SDfile   Computed 3D by Vconf -m prep SDfile
Find this compound or compounds like it in BindingDB:
Activity Spreadsheet -- Enzyme Inhibition Constant Data from BindingDB
Found 3 hits for monomerid = 139080
TargetE3 ubiquitin-protein ligase XIAP(Homo sapiens (Human))
The Regents Of The University Of Michigan
US Patent
LigandPNGBDBM139080(US8883771, 26)
Affinity DataIC50: <1.00E+3nMpH: 7.5Assay Description:Binding affinities of the present compounds to XIAP linker-BIR2-BIR3 (residues 120-356), cIAP1-BIR3 (residues 253-363), and cIAP-2 BIR3 (residues 238...
In DepthDetails US Patent
TargetBaculoviral IAP repeat-containing protein 3(Homo sapiens (Human))
The Regents Of The University Of Michigan
US Patent
LigandPNGBDBM139080(US8883771, 26)
Affinity DataIC50: <1.00E+3nMpH: 7.5Assay Description:Binding affinities of the present compounds to XIAP linker-BIR2-BIR3 (residues 120-356), cIAP1-BIR3 (residues 253-363), and cIAP-2 BIR3 (residues 238...
In DepthDetails US Patent
TargetBaculoviral IAP repeat-containing protein 2(Homo sapiens (Human))
The Regents Of The University Of Michigan
US Patent
LigandPNGBDBM139080(US8883771, 26)
Affinity DataIC50: <1.00E+3nMpH: 7.5Assay Description:Binding affinities of the present compounds to XIAP linker-BIR2-BIR3 (residues 120-356), cIAP1-BIR3 (residues 253-363), and cIAP-2 BIR3 (residues 238...
In DepthDetails US Patent