BDBM13924 (3aS,5R,6aR)-hexahydro-2H-cyclopenta[b]furan-5-yl N-[(2S,3R)-4-[(4-aminobenzene)(2-methylpropyl)sulfonamido]-3-hydroxy-1-phenylbutan-2-yl]carbamate::hexahydrocyclopenta[b]furanyl urethane analog 2
SMILES [H][C@]1(C[C@]2([H])CCO[C@]2([H])C1)OC(=O)N[C@@H](Cc1ccccc1)[C@H](O)CN(CC(C)C)S(=O)(=O)c1ccc(N)cc1
InChI Key InChIKey=KFUNUQZZJWGUMU-SJDFTCMESA-N
Data  1 KI
  Tab Delimited (TSV)   2D SDfile   Computed 3D by Vconf -m prep SDfile
Find this compound or compounds like it in BindingDB:
Activity Spreadsheet -- Enzyme Inhibition Constant Data from BindingDB
Found 1 hit for monomerid = 13924
TargetDimer of Gag-Pol polyprotein [501-599,Q508K,L534I,L564I,C568A,C596A](Human immunodeficiency virus type 1)
Purdue University
LigandPNGBDBM13924((3aS,5R,6aR)-hexahydro-2H-cyclopenta[b]furan-5-yl ...)
Affinity DataKi:  0.140nM ΔG°:  -13.4kcal/molepH: 6.4 T: 2°C. Assay description: The Ki values were determined by substrate cleavage assay using fluorogenic substrate, 2-(aminobenzoyl)-Thr-Ile-Nle-Phe(p-NO2)-Gln-Arg-NH2. A standar...
In DepthDetails ArticlePubMed