BDBM139478 US8889672, 317-048-002
SMILES CCOC(=O)c1c(N)scc1-c1ccc(OC)c(F)c1
InChI Key InChIKey=UGEFWTARRKFURL-UHFFFAOYSA-N
Data  1 IC50
  Tab Delimited (TSV)   2D SDfile   Computed 3D by Vconf -m prep SDfile
Find this compound or compounds like it in BindingDB:
Activity Spreadsheet -- Enzyme Inhibition Constant Data from BindingDB
Found 1 hit for monomerid = 139478
TargetProtein kinase C zeta type(Homo sapiens (Human))
University Of Michigan
US Patent
LigandPNGBDBM139478(US8889672, 317-048-002)
Affinity DataIC50:  1.70E+4nM. Assay description: IC50 values were determined using an in vitro luminescence-based kinase assay against aPKCζ to elucidate a pharmacophore. The IC50 values determ...
In DepthDetails US Patent