BDBM13955 US8846929, 180
SMILES O.[H][C@]12CC[C@]([H])(C[C@@]([H])(C1)n1c3ccccc3nc(NCc3ccc(cc3)C(O)=O)c1=O)N2C1CCCCCCC1
InChI Key InChIKey=AABJOWIKJWMIRS-AVEHMIFUSA-N
Data  1 KI
  Tab Delimited (TSV)   2D SDfile   Computed 3D by Vconf -m prep SDfile
Find this compound or compounds like it in BindingDB:
Activity Spreadsheet -- Enzyme Inhibition Constant Data from BindingDB
Found 1 hit for monomerid = 13955
TargetOpioid growth factor receptor-like protein 1(Homo sapiens (Human))
Purdue Pharma
US Patent
LigandPNGBDBM13955(US8846929, 180)
Affinity DataKi:  456nMpH: 7.4Assay Description:Radioligand binding assays (screening and dose-displacement) used 0.1nM [3H]-nociceptin (NEN; 87.7 Cl/nimole) with 10-20 ug membrane protein in a fin...
In DepthDetails US Patent