BDBM139639 US8894989, 17
SMILES O=c1[nH]nc2[nH]c(CN3CCC4(CC3)OCCO4)nc3cccc1c23
InChI Key InChIKey=AFYHJNDSTIFCGW-UHFFFAOYSA-N
Data  1 IC50
  Tab Delimited (TSV)   2D SDfile   Computed 3D by Vconf -m prep SDfile
Find this compound or compounds like it in BindingDB:
Activity Spreadsheet -- Enzyme Inhibition Constant Data from BindingDB
Found 1 hit for monomerid = 139639
TargetPoly [ADP-ribose] polymerase 1(Homo sapiens (Human))
Eisai
US Patent
LigandPNGBDBM139639(US8894989, 17)
Affinity DataIC50:  20nMpH: 8.0Assay Description:A convenient method to determine IC50 of a PARP inhibitor compound is a PARP assay using purified recombinant human PARP from Trevigan (Gaithersburg,...
In DepthDetails US Patent