BDBM139872 US8895592, 2
SMILES CCCCn1cc(s\c1=N/C(=O)c1cc(Cl)ccc1OCC(N)=O)C(C)(C)C
InChI Key InChIKey=LFVMBZLELINMSN-NMWGTECJSA-N
Data  2 KI
  Tab Delimited (TSV)   2D SDfile   Computed 3D by Vconf -m prep SDfile
Find this compound or compounds like it in BindingDB:
Activity Spreadsheet -- Enzyme Inhibition Constant Data from BindingDB
Found 2 hits for monomerid = 139872
TargetCannabinoid receptor 2(Rattus norvegicus (Rat))
Abbvie
US Patent
LigandPNGBDBM139872(US8895592, 2)
Affinity DataKi:  1.10nM. Assay description: The CB1 and CB2 radioligand binding assays described herein are utilized to ascertain the selectivity of compounds of the present application for bin...
In DepthDetails US Patent
TargetCannabinoid receptor 2(Homo sapiens (Human))
Abbvie
US Patent
LigandPNGBDBM139872(US8895592, 2)
Affinity DataKi:  3.10nM. Assay description: The CB1 and CB2 radioligand binding assays described herein are utilized to ascertain the selectivity of compounds of the present application for bin...
In DepthDetails US Patent