BDBM139912 US8895745, 359
SMILES CN(N)\N=C(/N)c1ccn2c(cnc2c1)-c1cccc(NC(=O)NCC(F)(F)F)c1
InChI Key InChIKey=NZJRYBFNAVWOTQ-UHFFFAOYSA-N
Data  1 IC50
  Tab Delimited (TSV)   2D SDfile   Computed 3D by Vconf -m prep SDfile
Find this compound or compounds like it in BindingDB:
Activity Spreadsheet -- Enzyme Inhibition Constant Data from BindingDB
Found 1 hit for monomerid = 139912
TargetFibroblast growth factor receptor 3(Homo sapiens (Human))
Astex Therapeutics
US Patent
LigandPNGBDBM139912(US8895745, 359)
Affinity DataIC50:  16.4nMpH: 7.5Assay Description:Enzymes (from Upstate) were prepared at 2x final concentration in 1x kinase assay buffer (as described below). Enzymes were then incubated with test ...
Ligand InfoPC cidPC sid
In DepthDetails US Patent