BDBM139992 US8901140, 7::US9358227, 7
SMILES CCOc1cc2ncnc(Nc3ccc(F)c(Cl)c3)c2cc1NC(=O)\C=C\[C@@H]1CCCN1C
InChI Key InChIKey=JZQOPZNZLUYLTR-DYLHUKMJSA-N
Data  2 IC50
  Tab Delimited (TSV)   2D SDfile   Computed 3D by Vconf -m prep SDfile
Find this compound or compounds like it in BindingDB:
Activity Spreadsheet -- Enzyme Inhibition Constant Data from BindingDB
Found 2 hits for monomerid = 139992
TargetEpidermal growth factor receptor(Homo sapiens (Human))
Jiangsu Hengrui Medicine
US Patent
LigandPNGBDBM139992(US8901140, 7 | US9358227, 7)
Affinity DataIC50:  4nM. Assay description: The following assay may be used to determine the activity of the compounds of the invention for inhibiting EGFR kinase activity. The half maximal inh...
In DepthDetails US Patent
TargetEpidermal growth factor receptor(Homo sapiens (Human))
Jiangsu Hengrui Medicine
US Patent
LigandPNGBDBM139992(US8901140, 7 | US9358227, 7)
Affinity DataIC50:  4nM. Assay description: The following assay may be used to determine the activity of the compounds of the invention for inhibiting EGFR kinase activity. The half maximal inh...
In DepthDetails US Patent