BDBM140011 US8901310, Comparator A
SMILES Cc1ncccc1CNC(=O)c1ccc2c(CC[C@@H]3C[C@@](O)(CCC(F)(F)F)CC[C@@]23Cc2ccccc2)c1
InChI Key InChIKey=KCAXPRFNWUOBNC-RDAHNBDFSA-N
Data  3 IC50
  Tab Delimited (TSV)   2D SDfile   Computed 3D by Vconf -m prep SDfile
Find this compound or compounds like it in BindingDB:
Activity Spreadsheet -- Enzyme Inhibition Constant Data from BindingDB
Found 3 hits for monomerid = 140011
TargetInterleukin-6(Homo sapiens (Human))
Pfizer
US Patent
LigandPNGBDBM140011(US8901310, Comparator A)
Affinity DataIC50: >36.4nM. Assay description: The glucocorticoid receptor fluorescence polarization ligand binding (GRFP) assay is used to evaluate direct binding of testing compounds to full-len...
In DepthDetails US Patent
TargetGlucocorticoid receptor(Homo sapiens (Human))
Pfizer
US Patent
LigandPNGBDBM140011(US8901310, Comparator A)
Affinity DataIC50:  7.10nM. Assay description: The glucocorticoid receptor fluorescence polarization ligand binding (GRFP) assay is used to evaluate direct binding of testing compounds to full-len...
In DepthDetails US Patent
TargetDisintegrin and metalloproteinase domain-containing protein 17(Homo sapiens (Human))
Pfizer
US Patent
LigandPNGBDBM140011(US8901310, Comparator A)
Affinity DataIC50: >1.00E+3nM. Assay description: The glucocorticoid receptor fluorescence polarization ligand binding (GRFP) assay is used to evaluate direct binding of testing compounds to full-len...
In DepthDetails US Patent