BDBM140045 US8901315, 58
SMILES Cc1nn(C2CCCCC2)c2sc(cc12)C(=O)Nc1ccc2N(CCc2c1)C(=O)C1CC1
InChI Key InChIKey=UKFKRBFKAVKCMA-UHFFFAOYSA-N
Data  2 IC50
  Tab Delimited (TSV)   2D SDfile   Computed 3D by Vconf -m prep SDfile
Find this compound or compounds like it in BindingDB:
Activity Spreadsheet -- Enzyme Inhibition Constant Data from BindingDB
Found 2 hits for monomerid = 140045
TargetPhosphodiesterase(Mus musculus (Mouse))
Daiichi Sankyo
US Patent
LigandPNGBDBM140045(US8901315, 58)
Affinity DataIC50:  3.60E+3nMpH: 6.5 T: 2°C. Assay description: The PDE 4 (phosphodiesterase IV) inhibiting effect of the compounds of the present invention was performed by the following method, which was modifie...
In DepthDetails US Patent
TargetHigh affinity cAMP-specific 3',5'-cyclic phosphodiesterase 7A(Homo sapiens (Human))
Daiichi Sankyo
US Patent
LigandPNGBDBM140045(US8901315, 58)
Affinity DataIC50:  36nMpH: 7.5 T: 2°C. Assay description: The PDE 7 (phosphodiesterase VII) inhibiting effect of the compounds of the present invention was performed by the following method, which was modifi...
In DepthDetails US Patent