BDBM14015 (5R)-31-oxo-20-oxa-2,6,11,13-tetraazahexacyclo[19.6.2.1^{2,5}.1^{15,19}.0^{9,13}.0^{24,28}]hentriaconta-1(27),9,11,15,17,19(30),21(29),22,24(28),25-decaene-18-carbonitrile::CHEMBL498260::Macrocyclic 3-Aminopyrrolidinone analog 67
SMILES O=C1[C@H]2CCN1c1cccc3ccc(Oc4cc(Cn5cncc5CCN2)ccc4C#N)cc13
InChI Key InChIKey=OBXLXUGOZZWQOW-XMMPIXPASA-N
Data  3 IC50
  Tab Delimited (TSV)   2D SDfile   Computed 3D by Vconf -m prep SDfile
Find this compound or compounds like it in BindingDB:
Activity Spreadsheet -- Enzyme Inhibition Constant Data from BindingDB
Found 3 hits for monomerid = 14015
LigandPNGBDBM14015((5R)-31-oxo-20-oxa-2,6,11,13-tetraazahexacyclo[19....)
Affinity DataIC50:  1.20nM. Assay description: Compounds were tested as inhibitors of FTase in vitro using purified recombinant human enzyme to catalyze the reaction between [3H]FPP and a recombin...
In DepthDetails ArticlePubMed
TargetPotassium voltage-gated channel subfamily H member 2(Homo sapiens (Human))
Astrazeneca
Curated by ChEMBL
LigandPNGBDBM14015((5R)-31-oxo-20-oxa-2,6,11,13-tetraazahexacyclo[19....)
Affinity DataIC50:  210nM. Assay description: Inhibition of human ERG channel
In DepthDetails ArticlePubMed
LigandPNGBDBM14015((5R)-31-oxo-20-oxa-2,6,11,13-tetraazahexacyclo[19....)
Affinity DataIC50:  35nM. Assay description: The enzymatic reaction between [3H]GGPP and a biotinylated peptide was carried out in the presence of 5 mM ATP and varying concentrations of inhibit...
In DepthDetails ArticlePubMed