BDBM140393 US8912173, 118
SMILES C[C@@H](Oc1cc(cc2ncccc12)-c1cnn(CCO)c1)[C@H]1CNC(=O)C1
InChI Key InChIKey=AMTJDVNGOJVQTM-UKRRQHHQSA-N
Data  1 IC50
  Tab Delimited (TSV)   2D SDfile   Computed 3D by Vconf -m prep SDfile
Find this compound or compounds like it in BindingDB:
Activity Spreadsheet -- Enzyme Inhibition Constant Data from BindingDB
Found 1 hit for monomerid = 140393
TargetTyrosine-protein kinase SYK(Homo sapiens (Human))
Boehringer Ingelheim International
US Patent
LigandPNGBDBM140393(US8912173, 118)
Affinity DataIC50:  0.100nMpH: 7.5 T: 2°C. Assay description: Recombinant human Syk (amino acids 342-635) was expressed as a fusion protein with an N-terminal GST tag, affinity-purified and deep-frozen at a conc...
In DepthDetails US Patent