BDBM14046 Aminofurazanyl-azabenzimidazole 6m::N-(3-{[2-(4-amino-1,2,5-oxadiazol-3-yl)-1-ethyl-1H-imidazo[4,5-c]pyridin-6-yl]oxy}phenyl)-4-[2-(dimethylamino)ethoxy]benzamide
SMILES CCn1c(nc2cnc(Oc3cccc(NC(=O)c4ccc(OCCN(C)C)cc4)c3)cc12)-c1nonc1N
InChI Key InChIKey=NWBWONVMLBVLGB-UHFFFAOYSA-N
Data  1 IC50
  Tab Delimited (TSV)   2D SDfile   Computed 3D by Vconf -m prep SDfile
Find this compound or compounds like it in BindingDB:
Activity Spreadsheet -- Enzyme Inhibition Constant Data from BindingDB
Found 1 hit for monomerid = 14046
TargetRho-associated protein kinase 1(Homo sapiens (Human))
Glaxosmithkline
LigandPNGBDBM14046(Aminofurazanyl-azabenzimidazole 6m | N-(3-{[2-(4-a...)
Affinity DataIC50: <1nMpH: 7.4 T: 2°C. Assay description: The assay of Rock-1 activity involved incubation with peptide substrate and ATP/[gamma-33P] ATP, the subsequent incorporation of 33P into the peptid...
In DepthDetails ArticlePubMed