BDBM140692 US8912224, 123
SMILES CN1CCOc2cc(ccc12)S(=O)(=O)NCc1cnc(Oc2ccc3OC(CCc3c2)c2ccccc2)s1
InChI Key InChIKey=HPBMJAKYJHYFHF-UHFFFAOYSA-N
Data  1 IC50
  Tab Delimited (TSV)   2D SDfile   Computed 3D by Vconf -m prep SDfile
Find this compound or compounds like it in BindingDB:
Activity Spreadsheet -- Enzyme Inhibition Constant Data from BindingDB
Found 1 hit for monomerid = 140692
TargetSodium/calcium exchanger 1(Homo sapiens (Human))
Sanofi
US Patent
LigandPNGBDBM140692(US8912224, 123)
Affinity DataIC50:  1.10E+3nM. Assay description: The assay is based on the monitoring of intracellular Ca2+concentrations using the calcium-sensitive dye Fluo-4. CHO cells expressing NCX1 were loade...
Ligand InfoPC cidPC sid
In DepthDetails US Patent