BDBM140798 US8912224, 233
SMILES CC(Cc1ccccc1)(NC(=O)c1cnc(Oc2ccc3O[C@@H](CCc3c2)c2ccccc2)s1)C(O)=O
InChI Key InChIKey=UHSJVEGLRQTHIT-QASNXKAYSA-N
Data  1 IC50
  Tab Delimited (TSV)   2D SDfile   Computed 3D by Vconf -m prep SDfile
Find this compound or compounds like it in BindingDB:
Activity Spreadsheet -- Enzyme Inhibition Constant Data from BindingDB
Found 1 hit for monomerid = 140798
TargetSodium/calcium exchanger 1(Homo sapiens (Human))
Sanofi
US Patent
LigandPNGBDBM140798(US8912224, 233)
Affinity DataIC50:  800nM. Assay description: The assay is based on the monitoring of intracellular Ca2+concentrations using the calcium-sensitive dye Fluo-4. CHO cells expressing NCX1 were loade...
In DepthDetails US Patent